{"text_format":"1","workbook":"xlsx","n_sheets":3,"sheets":["Tabella","Foglio1","Operativo"],"not_rendered":{"charts":0,"images":0,"macros":1,"external_links":0,"defined_names":0,"comments":0,"pivot_tables":0},"unopened":[],"bounds":{"document_bytes":16777216,"sheet_cells":100000,"rows_first":2000,"rows_last":500,"rows_between":2000,"halvings":0,"cell_chars":16384,"cell_head_chars":4096},"cells_cut":0,"cells_raw":0,"read":"whole","date_system":"1900"}

{"sheet":"Tabella","index":0,"n_rows":123,"n_cols":10,"rows_kept":123,"cut":false,"hidden":true,"merged":[]}
["N","ATTIVITÀ","UM","Coeff. Adottato","Esclusioni/Validità","Annotazioni prime","Annotazioni seconde","G","limiti","formula\n1=normale\n0 =valore con DM 2016"]
[1,"Stabilimenti ed impianti ove si producono e/o impiegano gas infiammabili e/o comburenti con quantità globali in ciclo superiori a 25Nmc/h","superficie in mq",358.8,null,"N.B.: la superficie deve essere solo la somma delle aree lorde di piano diverse. Le tettoie aperte almeno su un lato vanno conteggiate al 50%.","Qualora ci fossero piani ripetuti uguali, quindi non sommati nella superficie, per ognuno di essi si valuterà una superficie aggiuntiva pari al 10% di quella del piano.",0.95,0,1]
["2.1","Impianti di compressione o di decompressione dei gas infiammabili e/o comburenti potenzialità superiore a 50 Nmc/h, con esclusione dei sistemi di riduzione del gas naturale inseriti nelle reti di distribuzione con pressione di esercizio non superiore a 0,5 MPa","superficie in mq",156,"vale solo sino a 12 bar (per valori maggiori si veda 2.2 e 2.3)","N.B.: la superficie deve essere solo la somma delle aree lorde di piano diverse. Le tettoie aperte almeno su un lato vanno conteggiate al 50%.","Qualora ci fossero piani ripetuti uguali, quindi non sommati nella superficie, per ognuno di essi si valuterà una superficie aggiuntiva pari al 10% di quella del piano.",0.95,0,1]
["2.2","Impianti di compressione o di decompressione dei gas infiammabili e/o comburenti con potenzialità superiore a 50 Nmc/h, con esclusione dei sistemi di riduzione del gas naturale inseriti nelle reti di distribuzione con pressione di esercizio non superiore a 0,5 MPa","superficie in mq",312,"vale da 12,1 a 24 bar (per valori maggiori si veda 2.3)","N.B.: la superficie deve essere solo la somma delle aree lorde di piano diverse. Le tettoie aperte almeno su un lato vanno conteggiate al 50%.","Qualora ci fossero piani ripetuti uguali, quindi non sommati nella superficie, per ognuno di essi si valuterà una superficie aggiuntiva pari al 10% di quella del piano.",0.95,0,1]
["2.3","Impianti di compressione o di decompressione dei gas infiammabili e/o comburenti con potenzialità superiore a 50 Nm3/h, con esclusione dei sistemi di riduzione del gas naturale inseriti nelle reti di distribuzione con pressione di esercizio non superiore a 0,5 MPa","superficie in mq",468,"vale per pressioni superiori a  24 bar ","N.B.: la superficie deve essere solo la somma delle aree lorde di piano diverse. Le tettoie aperte almeno su un lato vanno conteggiate al 50%.","Qualora ci fossero piani ripetuti uguali, quindi non sommati nella superficie, per ognuno di essi si valuterà una superficie aggiuntiva pari al 10% di quella del piano.",0.95,0,1]
["3.a.1","Impianti di riempimento, depositi, rivendite di gas infiammabili in recipienti mobili:\na) compressi con capacità geometrica complessiva superiore o uguale a 0,75 mc","capacità in Nmc/h",468,"vale solo per impianti, per depositi e rivendite si veda 3.a.2  ",null,null,0.95,0,1]
["3.a.2","Impianti di riempimento, depositi, rivendite di gas infiammabili in recipienti mobili:\na) compressi con capacità geometrica complessiva superiore o uguale a 0,75 mc","superficie in mq",468,"vale solo per depositi e rivendite, per impianti si veda 3.a.1 ",null,"Se l'altezza del deposito  supera i tre metri, per ogni quota di tre metri o frazione, si sommerà la corrispondente area in pianta, valutata al 10 %, nel valore della superficie che costituisce il valore da immettere nella relativa cella.",0.95,0,1]
["3.b.1","Impianti di riempimento, depositi, rivendite, di gas infiammabili in recipienti mobili:\nb) disciolti o liquefatti per quantitativi in massa complessivi superiori o uguali a 75 kg","massa in kg",468,"vale solo per impianti, per depositi e rivendite si veda 3.b.2 ",null,null,0.95,0,1]
["3.b.2","Impianti di riempimento, depositi, rivendite, di\ngas infiammabili in recipienti mobili:\nb) disciolti o liquefatti per quantitativi in massa complessivi superiori o uguali a 75 kg","superficie in mq",358.8,"vale solo per depositi e rivendite, per impianti si veda 3.b.1","N.B.: la superficie deve essere solo la somma delle aree lorde di piano diverse. Le tettoie aperte almeno su un lato vanno conteggiate al 50%.","Qualora ci fossero piani ripetuti uguali, quindi non sommati nella superficie, per ognuno di essi si valuterà una superficie aggiuntiva pari al 10% di quella del piano.\nSe l'altezza del deposito  supera i tre metri, per ogni quota di tre metri o frazione, si sommerà la corrispondente area in pianta, valutata al 10 %, nel valore della superficie che costituisce il valore da immettere nella relativa cella.",0.95,0,1]
["4.a","Depositi di gas infiammabili in serbatoi fissi:\na) compressi per capacità geometrica complessiva superiore o uguale a 0,75 mc","capacità geometrica in mc",468,null,null,null,0.95,0,1]
["4.b","Depositi di gas infiammabili in serbatoi fissi:\nb) disciolti o liquefatti per capacità geometrica complessiva superiore o uguale a 0,3 mc","capacità geometrica in mc",468,null,null,null,0.95,0,1]
[5,"Depositi di gas comburenti compressi e/o\nliquefatti in serbatoi fissi e/o recipienti mobili per capacità geometrica complessiva superiore o uguale a 3 mc","capacità geometrica in mc",468,null,null,null,0.95,0,1]
["6.1","Reti di trasporto e di distribuzione di gas infiammabili, compresi quelli di origine petrolifera o chimica, con esclusione delle reti di distribuzione e dei relativi impianti con pressione di esercizio non superiore a 0,5 MPa","estensione rete in m",468,"è solo una stima, per valori economici vedere 6.2",null,null,0.95,0,1]
["6.2","Reti di trasporto e di distribuzione di gas infiammabili, compresi quelli di origine petrolifera o chimica, con esclusione delle reti di distribuzione e dei relativi impianti con pressione di esercizio non superiore a 0,5 MPa","valore opera in €",468,"calcola CP in funzione del valore immesso secondo D.M. 2016",null,null,0.95,0,0]
[7,"Centrali di produzione di idrocarburi liquidi e gassosi e di stoccaggio sotterraneo di gas naturale, piattaforme fisse e strutture fisse assimilabili, di perforazione e/o produzione di idrocarburi di cui al decreto del Presidente della Repubblica 24 maggio 1979, n. 886 ed al decreto legislativo 25 novembre 1996, n. 624","Nmc/h",468,null,null,null,0.95,0,1]
["8.1","Oleodotti con diametro superiore a 100 mm","estensione rete in m",468,"è solo una stima, per valori economici vedere 8.2",null,null,0.95,0,1]
["8.2","Oleodotti con diametro superiore a 100 mm","valore opera in €",468,"calcola CP in funzione del valore immesso secondo D.M. 2016",null,null,0.95,0,0]
[9,"Officine e laboratori con saldatura e taglio dei\nmetalli utilizzanti gas infiammabili e/o comburenti, con oltre 5 addetti alla mansione specifica di saldatura o taglio","superficie in mq",468,null,"N.B.: la superficie deve essere solo la somma delle aree lorde di piano diverse. Le tettoie aperte almeno su un lato vanno conteggiate al 50%.","Qualora ci fossero piani ripetuti uguali, quindi non sommati nella superficie, per ognuno di essi si valuterà una superficie aggiuntiva pari al 10% di quella del piano.",0.95,0,1]
["10.1","Stabilimenti ed impianti ove si producono e/o impiegano, liquidi infiammabili e/o combustibili con punto di infiammabilità fino a 125 °C, con quantitativi globali in ciclo e/o in deposito superiori a 1 mc","superficie in mq",468,"vale solo per produzione e/o per utilizzo, per depositi si veda 10.2","N.B.: la superficie deve essere solo la somma delle aree lorde di piano diverse. Le tettoie aperte almeno su un lato vanno conteggiate al 50%.","Qualora ci fossero piani ripetuti uguali, quindi non sommati nella superficie, per ognuno di essi si valuterà una superficie aggiuntiva pari al 10% di quella del piano.",0.95,0,1]
["10.2","Stabilimenti ed impianti ove si producono e/o\nimpiegano, liquidi infiammabili e/o combustibili con punto di infiammabilità fino a 125 °C, con quantitativi globali in ciclo e/o in deposito superiori a 1 mc","superficie in mq",358.8,"vale solo per depositi, per produzione e/o utilizzo si veda 10.1","N.B.: la superficie deve essere solo la somma delle aree lorde di piano diverse. Le tettoie aperte almeno su un lato vanno conteggiate al 50%.","Qualora ci fossero piani ripetuti uguali, quindi non sommati nella superficie, per ognuno di essi si valuterà una superficie aggiuntiva pari al 10% di quella del piano.\nSe l'altezza del deposito  supera i tre metri, per ogni quota di tre metri o frazione, si sommerà la corrispondente area in pianta, valutata al 10 %, nel valore della superficie che costituisce il valore da immettere nella relativa cella.",0.95,0,1]
["11.1","Stabilimenti ed impianti per la preparazione di oli lubrificanti, oli diatermici e simili, con punto di infiammabilità superiore a 125 °C, con quantitativi globali in ciclo e/o in deposito superiori a 5 mc","superficie in mq",468,"vale solo per produzione e/o per utilizzo, per depositi si veda 11.2","N.B.: la superficie deve essere solo la somma delle aree lorde di piano diverse. Le tettoie aperte almeno su un lato vanno conteggiate al 50%.","Qualora ci fossero piani ripetuti uguali, quindi non sommati nella superficie, per ognuno di essi si valuterà una superficie aggiuntiva pari al 10% di quella del piano.",0.95,0,1]
["11.2","Stabilimenti ed impianti per la preparazione di oli lubrificanti, oli diatermici e simili, con punto di infiammabilità superiore a 125 °C, con quantitativi globali in ciclo e/o in deposito superiori a 5 m3","superficie in mq",358.8,"vale solo per depositi, per produzione e/o utilizzo si veda 11.1","N.B.: la superficie deve essere solo la somma delle aree lorde di piano diverse. Le tettoie aperte almeno su un lato vanno conteggiate al 50%.","Qualora ci fossero piani ripetuti uguali, quindi non sommati nella superficie, per ognuno di essi si valuterà una superficie aggiuntiva pari al 10% di quella del piano.\nSe l'altezza del deposito  supera i tre metri, per ogni quota di tre metri o frazione, si sommerà la corrispondente area in pianta, valutata al 10 %, nel valore della superficie che costituisce il valore da immettere nella relativa cella.",0.95,0,1]
[12,"Depositi e/o rivendite di liquidi infiammabili e/o combustibili e/o oli lubrificanti, diatermici, di qualsiasi derivazione, di capacità geometrica complessiva superiore a 1 mc","superficie in mq",358.8,null,"N.B.: la superficie deve essere solo la somma delle aree lorde di piano diverse. Le tettoie aperte almeno su un lato vanno conteggiate al 50%.","Qualora ci fossero piani ripetuti uguali, quindi non sommati nella superficie, per ognuno di essi si valuterà una superficie aggiuntiva pari al 10% di quella del piano.\nSe l'altezza del deposito  supera i tre metri, per ogni quota di tre metri o frazione, si sommerà la corrispondente area in pianta, valutata al 10 %, nel valore della superficie che costituisce il valore da immettere nella relativa cella.",0.95,0,1]
["13.a.1","Impianti fissi di distribuzione carburanti per\nl’autotrazione, la nautica e l’aeronautica; contenitori - distributori rimovibili di carburanti liquidi:\na) Impianti di distribuzione carburanti liquidi ","ad erogatore",312000,"vale solo per impianti fissi carburanti liquidi, per distributori mobili si veda 13.a.2, per  distributori fissi si veda 13.b",null,null,0.95,0,1]
["13.a.2","Impianti fissi di distribuzione carburanti per l’autotrazione, la nautica e l’aeronautica; contenitori - distributori rimovibili di carburanti liquidi:\na) Impianti di distribuzione carburanti liquidi ","ad erogatore",156000,"vale solo per distributori mobili carburanti liquidi, per impianti fissi si veda 13.a.1, per distributori fissi si veda 13.b.",null,null,0.95,0,1]
["13.b","Impianti fissi di distribuzione carburanti per\nl’autotrazione, la nautica e l’aeronautica; contenitori - distributori rimovibili di carburanti liquidi:\nb) Impianti fissi di distribuzione carburanti gassosi e di tipo misto (liquidi e gassosi)","ad erogatore",546000,"vale solo per distributori fissi carburanti  gassosi e misti liquidi e gassosi, per impianti fissi si veda 13.a.1, per distributori mobili si veda 13.a.2. ",null,null,0.95,0,1]
[14,"Officine o laboratori per la verniciatura con vernici infiammabili e/o combustibili con oltre 5 addetti","superficie in mq",468,null,"N.B.: la superficie deve essere solo la somma delle aree lorde di piano diverse. Le tettoie aperte almeno su un lato vanno conteggiate al 50%.","Qualora ci fossero piani ripetuti uguali, quindi non sommati nella superficie, per ognuno di essi si valuterà una superficie aggiuntiva pari al 10% di quella del piano.",0.95,0,1]
[15,"Depositi e/o rivendite di alcoli con concentrazione superiore al 60% in volume di capacità geometrica superiore a 1 mc","superficie in mq",358.8,null,"N.B.: la superficie deve essere solo la somma delle aree lorde di piano diverse. Le tettoie aperte almeno su un lato vanno conteggiate al 50%.","Qualora ci fossero piani ripetuti uguali, quindi non sommati nella superficie, per ognuno di essi si valuterà una superficie aggiuntiva pari al 10% di quella del piano.\nSe l'altezza del deposito  supera i tre metri, per ogni quota di tre metri o frazione, si sommerà la corrispondente area in pianta, valutata al 10 %, nel valore della superficie che costituisce il valore da immettere nella relativa cella.",0.95,0,1]
["16.1","Stabilimenti di estrazione con solventi infiammabili e raffinazione di oli e grassi vegetali ed animali, con quantitativi globali di solventi in ciclo e/o in deposito superiori a 0,5 mc","superficie in mq",468,"vale solo per lavorazioni, per deposito si veda 16.2","N.B.: la superficie deve essere solo la somma delle aree lorde di piano diverse. Le tettoie aperte almeno su un lato vanno conteggiate al 50%.","Qualora ci fossero piani ripetuti uguali, quindi non sommati nella superficie, per ognuno di essi si valuterà una superficie aggiuntiva pari al 10% di quella del piano.",0.95,0,1]
["16.2","Stabilimenti di estrazione con solventi infiammabili e raffinazione di oli e grassi vegetali ed animali, con quantitativi globali di solventi in ciclo e/o in deposito superiori a 0,5 mc","superficie in mq",358.8,"vale solo per deposito, per lavorazioni si veda 16.1","N.B.: la superficie deve essere solo la somma delle aree lorde di piano diverse. Le tettoie aperte almeno su un lato vanno conteggiate al 50%.","Qualora ci fossero piani ripetuti uguali, quindi non sommati nella superficie, per ognuno di essi si valuterà una superficie aggiuntiva pari al 10% di quella del piano.\nSe l'altezza del deposito  supera i tre metri, per ogni quota di tre metri o frazione, si sommerà la corrispondente area in pianta, valutata al 10 %, nel valore della superficie che costituisce il valore da immettere nella relativa cella.",0.95,0,1]
{"$rows_left_out":94}
{"sheet":"Foglio1","index":1,"n_rows":10,"n_cols":11,"rows_kept":10,"cut":false,"hidden":true,"merged":[]}
["Attività","Descrizione ","UM","Valore","Limiti","Valore di calcolo","MOLTIPLICATORE","G","VALORE OPERA","Tariffa","Tariffa arr."]
[{"$f":"Operativo!A6","v":"XX"},{"$f":"VLOOKUP(A2,Tabella!A2:I123,2,FALSE)","v":"Qualsiasi ProgettoVVF per il quale si adotta il valore dell'opera per ottenere il CP"},{"$f":"VLOOKUP(A2,Tabella!A2:I123,3,FALSE)","v":"valore opera in €"},{"$f":"Operativo!D6","v":2850100},{"$f":"VLOOKUP(A2,Tabella!A2:I123,9,FALSE)","v":0},{"$f":"IF(D2-E2>0,D2-E2,1)","v":2850100},{"$f":"VLOOKUP(A2,Tabella!A2:I123,4,FALSE)","v":1},{"$f":"VLOOKUP(A2,Tabella!A2:I123,8,FALSE)","v":1.2},{"$f":"IF(E5=1,F2*G2*Operativo!E3/100,I5)","v":2850100},{"$f":"((0.03+10/I2^0.4)*100)*I2*H2*0.065*1.25/100+(1200*Operativo!E3/100)","v":17074.611351345531},{"$f":"IF(E5=1,ROUND(J2/100,0)*100,ROUND(J5/100,0)*100)","v":17100}]
[null,{"$f":"VLOOKUP(A2,Tabella!A2:I123,5,FALSE)","v":0}]
[null,{"$f":"VLOOKUP(A2,Tabella!A2:I123,6,FALSE)","v":"Industrie correnti  e civili rurali G=0,65.  Edifici residenziali ordinari, scuole materne G=0,95.\nIndustrie ordinarie con impiantii, manutenzione G=0,95  Scuole superiori G=1,15\nAlberghi, edifici civili pregiati, uffici, ospedali, università, cinema, teatri G=1,20\nManutenzione edifici storici non soggetti alla Soprintendenza G=1,20 invece se soggetti G=1,55\n"},null,null,"formula = 1 calcola\nformula = 0 no",null,null,null,"VALORE OPERA"]
[null,{"$f":"VLOOKUP(A2,Tabella!A2:I123,7,FALSE)","v":0},null,null,{"$f":"VLOOKUP(A2,Tabella!A2:J123,10,FALSE)","v":0},null,null,null,{"$f":"D2","v":2850100},{"$f":"((0.03+10/I5^0.4)*100)*I5*H2*0.065*1.25/100+(1200*Operativo!E3/100)","v":17074.611351345531}]
[]
[]
[null,{"$f":"INT(I2)","v":2850100},{"$f":"ROUND(B8/1000,1)*1000","v":2850100},{"$f":"TEXT(C8,\"€ #.#\")","v":"€ 2.850.100"}]
[]
["Nascondi"]

{"sheet":"Operativo","index":2,"n_rows":19,"n_cols":7,"rows_kept":19,"cut":false,"hidden":false,"merged":[[13,0,13,4],[12,0,12,4],[11,0,11,4],[7,1,7,4],[8,1,8,4],[0,0,0,2],[1,0,1,2],[2,0,2,2],[6,1,6,4],[0,3,0,4]]}
["PROGETTOVVF 2026 -                            La sola prima cifra nell'attività indica lo stesso numero dell'attività dell'Allegato I  DPR 151/2011",null,null,"Indice Istat "]
["L'eventuale lettera a seguire (a o b) indica la diversa tipologia come presente per alcune attività nell'Allegato I DPR 151/2011",null,null,"anno 1995","gennaio 2026"]
["L'eventuale ultima cifra differenzia il calcolo di CP in funzione della specificità identificata nella riga \"Particolarità\"",null,null,100,121.8]
["Attività","Descrizione ","UM","VALORE","CP  (compenso) €"]
[null,{"$f":"IF(D6>0,\"Moltiplicatore del valore di riferimento = \"&Foglio1!G2&\"; Grado di complessità = \"&Foglio1!H2&\"; Stima valore opere =  \"&Foglio1!D8,\"\")","v":"Moltiplicatore del valore di riferimento = 1; Grado di complessità = 1,2; Stima valore opere =  € 2.850.100"},"unità  misura","di riferimento > 0","compreso oneri"]
["XX",{"$f":"Foglio1!B2","v":"Qualsiasi ProgettoVVF per il quale si adotta il valore dell'opera per ottenere il CP"},{"$f":"Foglio1!C2","v":"valore opera in €"},2850100,{"$f":"IF(D6>0,Foglio1!K2,\"ERRORE VALORE\")","v":17100}]
["Particolarità",{"$f":"IF(Foglio1!B3=0,\"\",Foglio1!B3)","v":""},null,null,null,null,{"$f":"IF(Foglio1!B3=0,\"\",Foglio1!B3)","v":""}]
[null,{"$f":"IF(Foglio1!B4=0,\"\",Foglio1!B4)","v":"Industrie correnti  e civili rurali G=0,65.  Edifici residenziali ordinari, scuole materne G=0,95.\nIndustrie ordinarie con impiantii, manutenzione G=0,95  Scuole superiori G=1,15\nAlberghi, edifici civili pregiati, uffici, ospedali, università, cinema, teatri G=1,20\nManutenzione edifici storici non soggetti alla Soprintendenza G=1,20 invece se soggetti G=1,55\n"},null,null,null,null,{"$f":"IF(Foglio1!B4=0,\"\",Foglio1!B4)","v":"Industrie correnti  e civili rurali G=0,65.  Edifici residenziali ordinari, scuole materne G=0,95.\nIndustrie ordinarie con impiantii, manutenzione G=0,95  Scuole superiori G=1,15\nAlberghi, edifici civili pregiati, uffici, ospedali, università, cinema, teatri G=1,20\nManutenzione edifici storici non soggetti alla Soprintendenza G=1,20 invece se soggetti G=1,55\n"}]
[null,{"$f":"IF(Foglio1!B5=0,\"\",Foglio1!B5)","v":""},null,null,null,null,{"$f":"IF(Foglio1!B5=0,\"\",Foglio1!B5)","v":""}]
[null,"Inserisci nella cella verde C10 il valore di G che ricavi dalle righe soprastanti",1.2]
[null,{"$f":"IF(A6=\"\",\"  ERRORE NON E' POSSIBILE INSERIRE VALORI NELLA CELLA A6 SE NON CON L'USO DELL'ELENCO A DISCESA - RIPROVA\",\"\")","v":""}]
["CP.F1.VVF.OIM.2026.xlsm: documento approvato nel 2023 dalla Commissione Sicurezza Antincendio dell’Ordine Ingegneri di Milano; approvato nel 2023 dalla Commissione\n"]
["Pareri dell'Ordine Ingegneri di Milano e adottato dal Consiglio Ordine Ingegneri di Milano  nella seduta del 17.1.2024. Aggiornamento 2025 deliberato nella riunione del"]
["Consiglio Ordine Ingegneri di Milano il 7.5.2025 e successivamente nella seduta del 26.11.2025 con approvazione del 23.12.2025."]
[]
[]
[]
[]
["Nascondi"]